4-Methyl-2-(3,7,11-Trimethyldodecyl) thiophene

Kovats' RI, non-polar column, isothermal

View large format table.

Column type Active phase Temperature (C) I Reference Comment
CapillaryCP Sil 8 CB190.2110.Rullkötter, Landgraf, et al., 198850. m/0.22 mm/0.13 μm, He
CapillaryDexsil 400190.2144.Rullkötter, Landgraf, et al., 198850. m/0.22 mm/0.2 μm, He

References

Rullkötter, Landgraf, et al., 1988
Rullkötter, J.; Landgraf, M.; Disko, U., Gas Chromatographic and Mass Spectrometric Characterization of Isomeric Alkylthiophenes (C20) and Their Occurrence in Deep Sea Sediments, J. Hi. Res. Chromatogr. Chromatogr. Comm., 1988, 11, 9, 633-638, https://doi.org/10.1002/jhrc.1240110905 . [all data]