2-(2-Acetoxy-5-methoxy-4-ethylphenyl)ethylamine, N-acetyl-

Kovats' RI, non-polar column, temperature ramp

Data compiled by: NIST Mass Spectrometry Data Center, William E. Wallace, director

Column type Capillary
Active phase HP-1
Column length (m) 12.
Carrier gas He
Substrate
Column diameter (mm) 0.2
Phase thickness (μm) 0.33
Tstart (C) 100.
Tend (C) 310.
Heat rate (K/min) 30.
Initial hold (min) 3.
Final hold (min) 8.
I 2210.
ReferenceTheobald and Maurer, 2006
Comment MSDC-RI

References

Theobald and Maurer, 2006
Theobald, D.S.; Maurer, H.H., Studies on the metabolism and toxicological detection of the designer drug 4-ethyl-2,5-dimethoxy-β-phenethylamine (2C-E) in rat urine using gas chromatographic-mass spectrometric techniques, J. Chromatogr. B, 2006, 842, 2, 76-90, https://doi.org/10.1016/j.jchromb.2006.03.001 . [all data]