6-(1'-Hydroxyethyl)-7-methoxy-2,2-dimethylchromene

Normal alkane RI, polar column, temperature ramp

Data compiled by: NIST Mass Spectrometry Data Center, William E. Wallace, director

Column type Capillary
Active phase Carbowax 20M
Column length (m) 30.
Carrier gas He
Substrate
Column diameter (mm) 0.25
Phase thickness (μm) 0.325
Tstart (C) 50.
Tend (C) 215.
Heat rate (K/min) 4.
Initial hold (min)
Final hold (min) 20.
I 2545.
ReferenceKasali, Winterhalter, et al., 2002
Comment MSDC-RI

References

Kasali, Winterhalter, et al., 2002
Kasali, A.A.; Winterhalter, P.; Adio, A.M.; Knapp, H.; Bonnlander, B., Chromenes in Ageratum conyzoides L., Flavour Fragr. J., 2002, 17, 4, 247-250, https://doi.org/10.1002/ffj.1099 . [all data]