Glutaric acid, 3-methylbutyl propyl ester

Van Den Dool and Kratz RI, non-polar column, temperature ramp

Data compiled by: NIST Mass Spectrometry Data Center, William E. Wallace, director

Column type CapillaryCapillary
Active phase 5 % Phenyl methyl siloxane5 % Phenyl methyl siloxane
Column length (m) 30.30.
Carrier gas
Substrate
Column diameter (mm) 0.250.25
Phase thickness (μm) 0.250.25
Tstart (C) 60.60.
Tend (C) 270.270.
Heat rate (K/min) 15.15.
Initial hold (min)
Final hold (min) 15.15.
I 1656.1667.
ReferenceZaikin, 2009Zaikin, 2009
Comment MSDC-RI MSDC-RI

References

Zaikin, 2009
Zaikin, V.G., Personal Communication: Retention indices measured during the period 2008 to 2009, 2009. [all data]