4-Chlorobutyric acid, 3,5-dimethylphenyl ester

Van Den Dool and Kratz RI, non-polar column, temperature ramp

View large format table.

Column type Active phase I Reference Comment
Capillary5 % Phenyl methyl siloxane1744.Zaikin, 200930. m/0.25 mm/0.25 μm, 15. K/min, 270. C @ 15. min; Tstart: 60. C

Van Den Dool and Kratz RI, non-polar column, custom temperature program

View large format table.

Column type Active phase I Reference Comment
Capillary5 % Phenyl methyl siloxane1670.Zaikin, 2003Column length: 30. m; Column diameter: 0.19 mm; Program: 50 C to 120 C at 5 C/min; 120 C to 290 C at 12 C/min

References

Zaikin, 2009
Zaikin, V.G., Personal Communication: Retention indices measured during the period 2008 to 2009, 2009. [all data]

Zaikin, 2003
Zaikin, V.G., Personal Communication: Retention indices measured during the period 2001 to 2003, 2003. [all data]