3-O-Acetyl-1,4-anhydro-2,5-di-O-methyl-L-fucitol

Van Den Dool and Kratz RI, non-polar column, temperature ramp

View large format table.

Column type Active phase I Reference Comment
CapillaryDB-51355.88Wang, Elvebak, et al., 199530. m/0.25 mm/0.25 μm, He, 2. K/min; Tstart: 80. C; Tend: 300. C

References

Wang, Elvebak, et al., 1995
Wang, N.; Elvebak, L.E., II; Gray, G.R., Synthesis and characterization of authentic standards for the reductive-cleavage method. The positional isomers of partially methylated and acetylated or benzoylated 1,4-anhydro-L-fucitol, Carbohyd. Res., 1995, 274, 59-70, https://doi.org/10.1016/0008-6215(95)00081-4 . [all data]