1,4-Anhydro-2,3,5-tri-O-methyl-D-ribitol

Van Den Dool and Kratz RI, non-polar column, temperature ramp

View large format table.

Column type Active phase I Reference Comment
CapillaryDB-51208.41Wang and Gray, 199530. m/0.25 mm/0.25 μm, He, 2. K/min; Tstart: 80. C; Tend: 300. C

References

Wang and Gray, 1995
Wang, N.; Gray, G.R., Authentic standards for the reductive-cleavage method. The positional isomers of partially methylated and acetylated or benzoylated 1,4-anhydro-D-xylitol, Carbohyd. Res., 1995, 274, 45-58, https://doi.org/10.1016/0008-6215(95)00063-Y . [all data]