Quinolinic acid, 2TBDMS derivative

Normal alkane RI, non-polar column, temperature ramp

Data compiled by: NIST Mass Spectrometry Data Center, William E. Wallace, director

Column type Capillary
Active phase DB-5
Column length (m) 30.
Carrier gas Helium
Substrate
Column diameter (mm) 0.25
Phase thickness (μm) 0.25
Tstart (C) 60.
Tend (C) 290.
Heat rate (K/min) 4.
Initial hold (min) 2.
Final hold (min)
I 2166.
ReferencePaik, Lee, et al., 2005
Comment MSDC-RI

Van Den Dool and Kratz RI, non-polar column, custom temperature program

View large format table.

Column type Active phase I Reference Comment
CapillaryVF-5MS2156.Tret'yakov, 200830. m/0.25 mm/0.25 μm, He; Program: Multi-step temperature program; T(initial)=60C; T(final)=270C

References

Paik, Lee, et al., 2005
Paik, M.-J.; Lee, H.-J.; Kim, K.-R., Simultaneous retention index analysis of urinary amino acids and carboxylic acids for graphic recognition of abnormal state, J. Chromatogr. B, 2005, 821, 1, 94-104, https://doi.org/10.1016/j.jchromb.2005.04.011 . [all data]