3,6,9,12,15-Pentaoxahexadecan-1-ol, TBDMS derivative

Van Den Dool and Kratz RI, non-polar column, custom temperature program

Data compiled by: NIST Mass Spectrometry Data Center, William E. Wallace, director

Column type Capillary
Active phase VF-5MS
Column length (m) 30.
Carrier gas He
Substrate
Column diameter (mm) 0.25
Phase thickness (μm) 0.25
Program not specified
I 2130.1
ReferenceZheng and White, 2008
Comment MSDC-RI

References

Zheng and White, 2008
Zheng, Y.; White, E., Retention Data. NIST Mass Spectrometry Data Center., NIST Mass Spectrometry Data Center, 2008. [all data]