Heptacosyl acetate

Van Den Dool and Kratz RI, non-polar column, custom temperature program

View large format table.

Column type Active phase I Reference Comment
CapillaryVF-5MS3112.4Zheng and White, 200830. m/0.25 mm/0.25 μm, He; Program: not specified

Normal alkane RI, non-polar column, temperature ramp

View large format table.

Column type Active phase I Reference Comment
CapillaryDB-1MS3095.97Stransky, Zarevucka, et al., 200630. m/0.252 mm/0.25 μm, H2, 1. K/min; Tstart: 240. C; Tend: 340. C

References

Zheng and White, 2008
Zheng, Y.; White, E., Retention Data. NIST Mass Spectrometry Data Center., NIST Mass Spectrometry Data Center, 2008. [all data]

Stransky, Zarevucka, et al., 2006
Stransky, K.; Zarevucka, M.; Valterova, I.; Wimmer, Z., Gas chromatographic retention data of wax esters, J. Chromatogr. A, 2006, 1128, 1-2, 208-219, https://doi.org/10.1016/j.chroma.2006.06.035 . [all data]