Malonic acid, di(3-heptyl) ester

Van Den Dool and Kratz RI, non-polar column, custom temperature program

View large format table.

Column type Active phase I Reference Comment
Capillary5 % Phenyl methyl siloxane1838.Zaikin, 2008Column length: 30. m; Column diameter: 0.19 mm; Program: 20C => 5C/min => 120C => 10C/min => 280C

Normal alkane RI, non-polar column, temperature ramp

View large format table.

Column type Active phase I Reference Comment
CapillaryUltra-11791.Okumura, 199125. m/0.32 mm/0.25 μm, He, 3. K/min; Tstart: 80. C; Tend: 260. C

References

Zaikin, 2008
Zaikin, V.G., Personal Communication: Retention indices measured during the period 2007 to 2008, 2008. [all data]

Okumura, 1991
Okumura, T., retention indices of environmental chemicals on methyl silicone capillary column, Journal of Environmental Chemistry (Japan), 1991, 1, 2, 333-358, https://doi.org/10.5985/jec.1.333 . [all data]