1,9-Di(1-phenylpropoxy)-2,2,4,4,6,6,8,8-octamethyl-1,3,5,7,9-pentaoxa-2,4,6,8-tetrasilanonane

Van Den Dool and Kratz RI, non-polar column, custom temperature program

View large format table.

Column type Active phase I Reference Comment
Capillary5 % Phenyl methyl siloxane2399.Zaikin, 2008Column length: 30. m; Column diameter: 0.19 mm; Program: 20C => 5C/min => 120C => 10C/min => 280C

References

Zaikin, 2008
Zaikin, V.G., Personal Communication: Retention indices measured during the period 2007 to 2008, 2008. [all data]