Silane, dimethylhexyloxyhexadecyloxy-

Van Den Dool and Kratz RI, non-polar column, custom temperature program

Data compiled by: NIST Mass Spectrometry Data Center, William E. Wallace, director

Column type Capillary
Active phase 5 % Phenyl methyl siloxane
Column length (m) 30.
Carrier gas
Substrate
Column diameter (mm) 0.19
Phase thickness (μm)
Program 20C => 5C/min => 120C => 10C/min => 280C
I 2427.
ReferenceZaikin, 2008
Comment MSDC-RI

References

Zaikin, 2008
Zaikin, V.G., Personal Communication: Retention indices measured during the period 2007 to 2008, 2008. [all data]