Isophthalic acid, 2-formylphenyl pentyl ester

Van Den Dool and Kratz RI, non-polar column, custom temperature program

View large format table.

Column type Active phase I Reference Comment
Capillary5 % Phenyl methyl siloxane2839.Zaikin, 2007Column length: 20. m; Column diameter: 0.19 mm; Program: 20C => 5C/min => 120C => 10C/min => 280C

References

Zaikin, 2007
Zaikin, V.G., Personal Communication: Retention indices measured during the period 2006 to 2007 (II), 2007. [all data]