Methyl 9-eicosenoate

Normal alkane RI, non-polar column, isothermal

View large format table.

Column type Active phase Temperature (C) I Reference Comment
CapillaryLM-1210.2287.Filho and Lancas, 199530. m/0.25 mm/0.25 μm, Hydrogen

References

Filho and Lancas, 1995
Filho, N.R.A.; Lancas, F.M., Identification of FAMEs using ECL values and a three-dimensional Kovats retention index system, J. High Resol. Chromatogr., 1995, 18, 3, 167-170, https://doi.org/10.1002/jhrc.1240180306 . [all data]