Hexadecanoic acid, pyrrolidide

Kovats' RI, non-polar column, temperature ramp

Data compiled by: NIST Mass Spectrometry Data Center, William E. Wallace, director

Column type Capillary
Active phase DB-1
Column length (m) 30.
Carrier gas He
Substrate
Column diameter (mm) 0.32
Phase thickness (μm)
Tstart (C) 70.
Tend (C) 300.
Heat rate (K/min) 6.
Initial hold (min)
Final hold (min)
I 2530.
ReferenceTofern, Mann, et al., 1999
Comment MSDC-RI

References

Tofern, Mann, et al., 1999
Tofern, B.; Mann, P.; Kaloga, M.; Jenett-Siems, K.; Witte, L.; Eich, E., Aliphatic pyrrolidine amides from two tropical convolvulaceous species, Phytochemistry, 1999, 52, 8, 1437-1441, https://doi.org/10.1016/S0031-9422(99)00245-9 . [all data]