1-Tetradecanol, picolinyloxydimethylsilyl ether

Van Den Dool and Kratz RI, non-polar column, custom temperature program

Data compiled by: NIST Mass Spectrometry Data Center, William E. Wallace, director

Column type CapillaryCapillary
Active phase VF-5MSVF-5MS
Column length (m) 30.30.
Carrier gas HeHe
Substrate
Column diameter (mm) 0.250.25
Phase thickness (μm) 0.250.25
Program Multi-step temperature program; T(initial)=60C; T(final)=270CMulti-step temperature program; T(initial)=60C; T(final)=270C
I 2533.62541.2
ReferenceTret'yakov, 2007Tret'yakov, 2007
Comment MSDC-RI MSDC-RI

References

Tret'yakov, 2007
Tret'yakov, K.V., Retention Data. NIST Mass Spectrometry Data Center., NIST Mass Spectrometry Data Center, 2007. [all data]