Histamine, 3TMS derivative

Kovats' RI, non-polar column, isothermal

Data compiled by: NIST Mass Spectrometry Data Center, William E. Wallace, director

Column type Packed
Active phase OV-1
Column length (m) 2.
Carrier gas N2
Substrate GasChrom Q
Column diameter (mm)
Phase thickness (μm)
Temperature (C) 190.
I 1870.
ReferenceCashaw, Walsh, et al., 1971
Comment MSDC-RI

Van Den Dool and Kratz RI, non-polar column, temperature ramp

View large format table.

Column type Active phase I Reference Comment
PackedOV-11873.Butts, 1972He, Chromosorb W HP (80-100 mesh), 10. K/min; Column length: 2. m; Tstart: 100. C; Tend: 325. C

Van Den Dool and Kratz RI, non-polar column, custom temperature program

View large format table.

Column type Active phase I Reference Comment
CapillaryVF-5MS1880.3Tret'yakov, 200730. m/0.25 mm/0.25 μm, He; Program: Multi-step temperature program; T(initial)=60C; T(final)=270C

References

Cashaw, Walsh, et al., 1971
Cashaw, J.L.; Walsh, M.J.; Yamanaka, Y.; Davis, V.E., Simultaneous determination of biogenic amines and narcotic alkaloids by gas-liquid chromatography, J. Chromatogr. Sci., 1971, 9, 2, 98-104, https://doi.org/10.1093/chromsci/9.2.98 . [all data]