2-Ketoglutaric acid pfbo-tms

Van Den Dool and Kratz RI, non-polar column, temperature ramp

Data compiled by: NIST Mass Spectrometry Data Center, William E. Wallace, director

Column type Capillary
Active phase DB-1
Column length (m) 30.
Carrier gas He
Substrate
Column diameter (mm) 0.53
Phase thickness (μm) 1.
Tstart (C) 70.
Tend (C) 290.
Heat rate (K/min) 4.
Initial hold (min)
Final hold (min)
I 1961.
ReferenceHoffmann, Aramaki, et al., 1989
Comment MSDC-RI

References

Hoffmann, Aramaki, et al., 1989
Hoffmann, G.; Aramaki, S.; Blum-Hoffmann, E.; Nyhan, W.L.; Sweetman, L., Quantitative analysis for organic acids in biological samples: batch isolation followed by gas chromatographic-mass spectrometric analysis, Clin. Chem., 1989, 35, 4, 587-595. [all data]