2,4-Dimethylcarbazole

Normal alkane RI, non-polar column, temperature ramp

View large format table.

Column type Active phase I Reference Comment
CapillaryPONA1932.Yang, Wang, et al., 200450. m/0.20 mm/0.50 μm, 1.5 K/min, 270. C @ 10. min; Tstart: 120. C

References

Yang, Wang, et al., 2004
Yang, Y.; Wang, Z.; Yang, H.; Lu, W., Study on distribution of nitrogen compounds in catalytic diesel oil by gas chromatography - atomic emission detector, Chin. J. Chromatogr., 2004, 22, 5, 499-504. [all data]