2,5-Dimethyl-4-ethoxy-3(2H)furanone

Normal alkane RI, non-polar column, custom temperature program

View large format table.

Column type Active phase I Reference Comment
CapillaryDB-11090.Buttery and Ling, 1996Column length: 60. m; Column diameter: 0.25 mm; Program: not specified

References

Buttery and Ling, 1996
Buttery, R.G.; Ling, L.C., Direct formation of 4-alkoxy derivatives from 2,5-fimethyl-4-hydroxy-3(2H)-furanone and aliphatic alcohols, J. Agric. Food Chem., 1996, 44, 6, 1512-1514, https://doi.org/10.1021/jf950451g . [all data]