d-Proline, n-propoxycarbonyl-, octadecyl ester

Van Den Dool and Kratz RI, non-polar column, custom temperature program

View large format table.

Column type Active phase I Reference Comment
Capillary5 % Phenyl methyl siloxane3081.Zaikin, 2005Column length: 30. m; Column diameter: 0.19 mm; Program: 20C => 5C/min => 120C => 10C/min => 280C

References

Zaikin, 2005
Zaikin, V.G., Personal Communication: Retention indices measured during the period 2004 to 2005, 2005. [all data]