Cyclobutyl isopropylphosphonofluoridate

Normal alkane RI, non-polar column, temperature ramp

View large format table.

Column type Active phase I Reference Comment
CapillaryHP-5MS1143.Sliwakowski, Jasinska, et al., 200030. m/0.25 mm/0.25 μm, 40. C @ 2. min, 10. K/min, 270. C @ 5. min

References

Sliwakowski, Jasinska, et al., 2000
Sliwakowski, M.; Jasinska, J.; Chalas, A., Effect of the allyl substituent on changes of retention index values and mass spectra of O-alkyl alkylphosphonofluoridates. Part 1. O-Cycloalkyl derivatives., Wojskowy Institut Chemii i Radiometrii. Biuletyn Informacyjny WIChiR, 2000, 1, 30, 13-20. [all data]