(Z,Z)-α-Farnesene

Van Den Dool and Kratz RI, non-polar column, temperature ramp

View large format table.

Column type Active phase I Reference Comment
CapillaryBP-11462.Boti, Koukoua, et al., 200750. m/0.22 mm/0.25 μm, He, 2. K/min, 220. C @ 20. min; Tstart: 60. C

Van Den Dool and Kratz RI, polar column, temperature ramp

View large format table.

Column type Active phase I Reference Comment
CapillaryBP-201697.Boti, Koukoua, et al., 200750. m/0.22 mm/0.25 μm, He, 2. K/min, 220. C @ 20. min; Tstart: 60. C

Normal alkane RI, non-polar column, temperature ramp

View large format table.

Column type Active phase I Reference Comment
CapillaryZB-51499.Vazques, Aimar, et al., 201130. m/0.25 mm/0.25 μm, Nitrogen, 40. C @ 5. min, 5. K/min; Tend: 200. C
CapillaryZB-51502.Vazquez, Demmel, et al., 201130. m/0.25 mm/0.25 μm, Nitrogen, 40. C @ 5. min, 5. K/min, 200. C @ 5. min
CapillaryMethyl Silicone1461.Ozcan and Chalchat, 2007Helium, 3. K/min; Column length: 50. m; Column diameter: 0.25 mm; Tstart: 50. C; Tend: 240. C
CapillaryHP-51462.Oyedeji, Yani, et al., 200530. m/0.25 mm/0.25 μm, He, 5. K/min; Tstart: 70. C; Tend: 240. C
CapillarySPB-11477.Vijayanand, Rao, et al., 200130. m/0.32 mm/0.25 μm, He, 2. K/min; Tstart: 50. C; Tend: 250. C

Normal alkane RI, non-polar column, custom temperature program

View large format table.

Column type Active phase I Reference Comment
CapillaryZB-51500.Vazques, Aimar, et al., 201130. m/0.25 mm/0.25 μm, Nitrogen; Program: not specified
CapillaryZB-51502.Vazquez, Demmel, et al., 201130. m/0.25 mm/0.25 μm, Nitrogen; Program: not specified
CapillarySE-521506.Tognolini, Barocelli, et al., 200630. m/0.32 mm/0.15 μm, He; Program: 45C => 1C/min => 100C => 5C/min => 250C (10min)
CapillarySE-301492.Vinogradov, 2004Program: not specified
CapillaryMethyl Silicone1492.Zenkevich, 1996Program: not specified

Normal alkane RI, polar column, temperature ramp

View large format table.

Column type Active phase I Reference Comment
CapillarySupelcowax-101697.Ramaswami, Briscese, et al., 198850. C @ 2. min, 4. K/min, 240. C @ 10. min; Column length: 30. m
CapillarySupelcowax-101697.Ramaswami, Briscese, et al., 1986He, 50. C @ 2. min, 4. K/min, 240. C @ 10. min; Column length: 30. m

Normal alkane RI, polar column, custom temperature program

View large format table.

Column type Active phase I Reference Comment
CapillaryCarbowax 20M1685.Vinogradov, 2004Program: not specified

References

Boti, Koukoua, et al., 2007
Boti, J.B.; Koukoua, G.; N'Guessan, T.Y.; Casanova, J., Chemical variability of Conyza sumatrensis and Microglossa pyrifolia from Côte d'Ivoire, Flavour Fragr. J., 2007, 22, 1, 27-31, https://doi.org/10.1002/ffj.1743 . [all data]

Vazques, Aimar, et al., 2011
Vazques, A.M.; Aimar, M.L.; Demmel, G.I.; Criado, S.G.; Ruiz, G.M.; Cantero, J.J.; Rossi, L.I.; Velasco, M.I., Determination of volatile organic compounds of Tagetes argentina Cabrera (asteraceae) using HS-SPME analysis, Boletin Latinoamericano y del Caribe Plantas Medicinales y Aromaticas, 2011, 10, 5, 463-469. [all data]

Vazquez, Demmel, et al., 2011
Vazquez, A.M.; Demmel, G.I.; Criado, S.G.; Aimar, M.L.; Cantero, J.; Rossi, L.I.; Velasco, M.I., Phytochemistry of TAgetes minuta L. (Asteraceae) from Cordoba, Argentina: comparative study between essential oil and HS-SPME analyses, Boletin Latinoamericano y del Caribe Plantas Medicinales y Aromaticas, 2011, 10, 4, 351-362. [all data]

Ozcan and Chalchat, 2007
Ozcan, M.M.; Chalchat, J.C., Chemical Composition od Carrot Seeds (Daucus carota L.) Cultivated in Turkey: Characterization of the Seed Oil and Essential Oil, Grasas y Aceites, 2007, 58, 4, 359-365. [all data]

Oyedeji, Yani, et al., 2005
Oyedeji, O.A.; Yani, V.V.; Afolayan, A.J., Chemical composition of the essential oil from Arctotis arctotoides (L.F.) O. Hoffm. (syn. Vendium arctotoides Less.), Flavour Fragr. J., 2005, 20, 2, 232-234, https://doi.org/10.1002/ffj.1437 . [all data]

Vijayanand, Rao, et al., 2001
Vijayanand, P.; Rao, L.J.M.; Narasimham, P., Volatile flavour components of jamun fruit (Syzygium cumini L), Flavour Fragr. J., 2001, 16, 1, 47-49, https://doi.org/10.1002/1099-1026(200101/02)16:1<47::AID-FFJ944>3.0.CO;2-L . [all data]

Tognolini, Barocelli, et al., 2006
Tognolini, M.; Barocelli, E.; Ballabeni, V.; Bruni, R.; Bianchi, A.; Chiavarini, M.; Impicciatore, M., Comparative screening of plant essential oils: Phenylpropanoid moiety as basic core for antiplatelet activity, Life Sciences, 2006, 78, 13, 1419-1432, https://doi.org/10.1016/j.lfs.2005.07.020 . [all data]

Vinogradov, 2004
Vinogradov, B.A., Production, composition, properties and application of essential oils, 2004, retrieved from http://viness.narod.ru. [all data]

Zenkevich, 1996
Zenkevich, I.G., Analytical Parameters of Components of Essential Oils for their Chromatographic and Chromato-Mass Spectral Identification. Mono- and Sesquiterpenes, Rastitelnye Resursy (Plant resources), 1996, 34, 1-2, 48-58. [all data]

Ramaswami, Briscese, et al., 1988
Ramaswami, S.K.; Briscese, P.; Gargiullo, R.J.; von Geldern, T., Sesquiterpene hydrocarbons: from mass confusion to orderly line-up in Flavors and Fragrances: A World Perspective. Proceedings of the 10th International Congress of Essential Oils, Fragrances and Flavors, Lawrence,B.M.; Mookherjee,B.D.; Willis,B.J., ed(s)., Elsevier, New York, 1988, 951-980. [all data]

Ramaswami, Briscese, et al., 1986
Ramaswami, S.K.; Briscese, P.; Gargiullo, R.J.; von Geldern, T., Sesquiterpene hydrocarbons: from mass confusion to orderly line-up in Flavors and Fragrances: A World Perspective, Lawrence,B.M.; Mookherjee,B.D.; Willis,B.J., ed(s)., Proceedings of the 10th International Congress of Essential Oils, Fragrances, and Flavors, Washington, DC, 1986, 951-959. [all data]