1-Acetyl-4-(2-acetoxyphenyl)piperazine

Kovats' RI, non-polar column, temperature ramp

View large format table.

Column type Active phase I Reference Comment
CapillaryHP-12140.Staack and Maurer, 200312. m/0.20 mm/0.33 μm, He, 30. K/min; Tstart: 100. C; Tend: 310. C

References

Staack and Maurer, 2003
Staack, R.F.; Maurer, H.H., Toxicological detection of the new designer drug 1-(4-methoxyphenyl)piperazine and its metabolites in urine and differentiation from an intake of structurally related medicaments using gas chromatography-mass spectrometry, J. Chromatogr. B, 2003, 798, 2, 333-342, https://doi.org/10.1016/j.jchromb.2003.10.004 . [all data]