2-Acetyl-1,2,3,4,9,13b-hexahydro-2,4a-diaza-tribenzo[a,c,E]cyclohepten-7-ol, acetate (ester)

Normal alkane RI, non-polar column, custom temperature program

View large format table.

Column type Active phase I Reference Comment
PackedOV-1013005.Maurer and Pfleger, 1984Program: not specified

References

Maurer and Pfleger, 1984
Maurer, H.; Pfleger, K., Screening procedure for detection of antidepressants and their metabolites in urine using a computerized gas chromatographic-mass spectrometric technique, J. Chromatogr., 1984, 305, 309-323, https://doi.org/10.1016/S0378-4347(00)83345-9 . [all data]