4b,8-Dimethyl-2-isopropylphenanthrene, 4b,5,6,7,8,8a,9,10-octahydro-

Normal alkane RI, non-polar column, custom temperature program

View large format table.

Column type Active phase I Reference Comment
CapillaryDB-51969.Hamm, Bleton, et al., 200430. m/0.25 mm/0.25 μm, He; Program: 40C(1min) => 9C/min => 130C => 2C/min => 230C

References

Hamm, Bleton, et al., 2004
Hamm, S.; Bleton, J.; Tchapla, A., Headspace solid phase microextraction for screening for the presence of resins in Egyptian archaeological samples, J. Sep. Sci., 2004, 27, 3, 235-243, https://doi.org/10.1002/jssc.200301611 . [all data]