Ledene alcohol

Normal alkane RI, non-polar column, temperature ramp

Data compiled by: NIST Mass Spectrometry Data Center, William E. Wallace, director

Column type Capillary
Active phase CP Sil 8 CB
Column length (m) 30.
Carrier gas He
Substrate
Column diameter (mm) 0.25
Phase thickness (μm) 0.25
Tstart (C) 80.
Tend (C) 200.
Heat rate (K/min) 3.
Initial hold (min) 5.
Final hold (min) 5.
I 1570.
ReferenceFacey, Porter, et al., 2005
Comment MSDC-RI

References

Facey, Porter, et al., 2005
Facey, P.C.; Porter, R.B.R.; Reese, P.B.; Williams, L.A.D., Biological activity and chemical composition of the essential oil from Jamaican Hyptis verticillata Jacq., J. Agric. Food Chem., 2005, 53, 12, 4774-4777, https://doi.org/10.1021/jf050008y . [all data]