Epicedrol

Normal alkane RI, non-polar column, custom temperature program

Data compiled by: NIST Mass Spectrometry Data Center, William E. Wallace, director

Column type CapillaryCapillary
Active phase HP-5MSOV-1
Column length (m) 30.30.
Carrier gas HeHe
Substrate
Column diameter (mm) 0.250.25
Phase thickness (μm) 0.250.25
Program 50C => 8C/min => 200C => 10C/min => 270C (5min)45 0C (4 min) 3 0C/min -> 75 0C 4 0C/min -> 115 0C 6 0C/min -> 312 0C
I 1632.1600.
ReferenceDeng, Yao, et al., 2005Hafez and Abdel-Salam, 2004
Comment MSDC-RI MSDC-RI

Kovats' RI, non-polar column, temperature ramp

View large format table.

Column type Active phase I Reference Comment
CapillaryDB-51611.Adams, 199930. m/0.26 mm/0.25 μm, He, 3. K/min; Tstart: 60. C; Tend: 246. C

Van Den Dool and Kratz RI, non-polar column, temperature ramp

View large format table.

Column type Active phase I Reference Comment
CapillaryHP-51626.Liu J.M., Nan P., et al., 200630. m/0.25 mm/0.25 μm, He, 60. C @ 2. min, 10. K/min, 250. C @ 10. min
CapillaryHP-5MS1615.Vujisic L., Vuckovic I., et al., 200630. m/0.25 mm/0.25 μm, H2, 4.3 K/min; Tstart: 50. C; Tend: 285. C
CapillarySE-541608.Simionatto, Porto, et al., 200525. m/0.25 mm/0.2 μm, H2, 4. K/min; Tstart: 50. C; Tend: 250. C
CapillaryRTX-11616.Cavalli, Tomi, et al., 200360. m/0.22 mm/0.25 μm, He, 2. K/min, 230. C @ 45. min; Tstart: 60. C
CapillaryRTX-51611.Shellie, Marriott, et al., 200330. m/0.25 mm/0.25 μm, He, 45. C @ 6. min, 3. K/min; Tend: 250. C
CapillaryHP-51611.Skaltsa, Demetzos, et al., 200330. m/0.25 mm/0.25 μm, He, 60. C @ 5. min, 4. K/min; Tend: 280. C
CapillaryHP-5MS1611.Demetzos, Angelopoulou, et al., 200230. m/0.25 mm/0.25 μm, 50. C @ 5. min, 3. K/min; Tend: 280. C
CapillaryDB-51613.Nogueira, Bittrich, et al., 200130. m/0.25 mm/0.25 μm, H2, 3. K/min; Tstart: 60. C; Tend: 240. C

Van Den Dool and Kratz RI, polar column, temperature ramp

View large format table.

Column type Active phase I Reference Comment
CapillaryRTX-Wax2147.Cavalli, Tomi, et al., 200360. m/0.22 mm/0.25 μm, He, 2. K/min, 230. C @ 45. min; Tstart: 60. C

Normal alkane RI, non-polar column, temperature ramp

View large format table.

Column type Active phase I Reference Comment
CapillaryDB-51619.Ho, Wang, et al., 201030. m/0.25 mm/0.25 μm, Helium, 2. K/min; Tstart: 50. C; Tend: 250. C
CapillaryDB-51619.Ho, Wang, et al., 200930. m/0.25 mm/0.25 μm, Helium, 50. C @ 2. min, 5. K/min; Tend: 250. C
CapillaryDB-11626.Perez-Alonso, Velasco-Negueruela, et al., 200350. m/0.25 mm/0.25 μm, N2, 4. K/min; Tstart: 95. C; Tend: 240. C
CapillaryDB-5MS1593.Cherchi, Deidda, et al., 200130. m/0.25 mm/0.25 μm, He, 3. K/min; Tstart: 60. C; Tend: 240. C

References

Deng, Yao, et al., 2005
Deng, C.; Yao, N.; Wang, A.; Zhang, X., Determination of essential oil in a traditional Chinese medicine, Fructus amomi by pressurized hot water extraction followed by liquid-phase microextraction and gas chromatography-mass spectrometry, Anal. Chim. Acta., 2005, 536, 1-2, 237-244, https://doi.org/10.1016/j.aca.2004.12.044 . [all data]

Hafez and Abdel-Salam, 2004
Hafez, S.S.; Abdel-Salam, H.A., chemical composition and antimicrobial activity of the volatile constituents of thuja occidentalis L. growing in Egipt, Alexandria J. Pharm. Sci., 2004, 18, 1, 41-47. [all data]