Tetrahydrocortisol, TMS

Van Den Dool and Kratz RI, non-polar column, temperature ramp

View large format table.

Column type Active phase I Reference Comment
CapillaryDB-13118.Ludwig-Koehn and Henning, 198630. m/0.25 mm/0.25 μm, H2, 2. K/min; Tstart: 120. C; Tend: 280. C
CapillarySE-303131.Ludwig-Köhn, Sziedat, et al., 1980He, 2. K/min; Column length: 20. m; Tstart: 150. C; Tend: 295. C

Normal alkane RI, non-polar column, custom temperature program

View large format table.

Column type Active phase I Reference Comment
CapillaryHP-13127.Pereira, Marques, et al., 200117. m/0.20 mm/0.11 μm, Helium; Program: 180 0C 3 0C/min -> 229 0C 40 0C/min -> 310 0C (5 min)

References

Ludwig-Koehn and Henning, 1986
Ludwig-Koehn, H.; Henning, H.V., Some aspects of quantification of neutral steroid metabolites in body fluids of healthy and uremic subjects by capillary gas chromatography, J. Hi. Res. Chromatogr. Chromatogr. Comm., 1986, 9, 1, 35-38, https://doi.org/10.1002/jhrc.1240090106 . [all data]

Ludwig-Köhn, Sziedat, et al., 1980
Ludwig-Köhn, H.; Sziedat, A.; Spiteller, G.; Matthaei, D.; Henning, H.V.; Scheler, F., Occurrence of highly oxygen-substituted androgens in hemofiltrates of uremic patients, Biomed. Mass Spectrom., 1980, 7, 7, 284-287, https://doi.org/10.1002/bms.1200070704 . [all data]

Pereira, Marques, et al., 2001
Pereira, H.M.G.; Marques, M.A.S.; Cardoso, J.N.; Neto, F.R.A., Derivatization study of endogenous and synthetic corticosteroids by gas chromatography mass spectrometry in Recent Advances in Doping Analysis, Schanzer, W.; Geyer, H.; Gotzmann, A.; Mareck-Engelke, U., ed(s)., Sport und Buch Strauss, Koln, 2001, 203-207. [all data]