E-15-Heptadecenal

Van Den Dool and Kratz RI, non-polar column, temperature ramp

View large format table.

Column type Active phase I Reference Comment
CapillaryHP-5MS2083.2Zhao, Liang, et al., 200530. m/0.25 mm/0.25 μm, He, 2. K/min; Tstart: 80. C; Tend: 290. C
CapillaryHP-5MS2084.5Zhao, Liang, et al., 200530. m/0.25 mm/0.25 μm, He, 4. K/min; Tstart: 80. C; Tend: 290. C
CapillaryHP-5MS2085.5Zhao, Liang, et al., 200530. m/0.25 mm/0.25 μm, He, 6. K/min; Tstart: 80. C; Tend: 290. C

Normal alkane RI, non-polar column, custom temperature program

View large format table.

Column type Active phase I Reference Comment
CapillaryRTX-5 MS2104.Nadaf, Halimi, et al., 201215. m/0.25 mm/0.25 μm, Helium; Program: 35 0C (6 min) 5 0C/min -> 150 0C 10 0C/min -> 280 0C (3 min)

References

Zhao, Liang, et al., 2005
Zhao, C.-X.; Liang, Y.-Z.; Fang, H.-Z.; Li, X.-N., Temperature-programmed retention indices for gas chromatography-mass spectroscopy analysis of plant essential oils, J. Chromatogr. A, 2005, 1096, 1-2, 76-85, https://doi.org/10.1016/j.chroma.2005.09.067 . [all data]

Nadaf, Halimi, et al., 2012
Nadaf, M.; Halimi, M.; Mortazavi, M., Identification of nonpolar chemical composition Spartium junceum flower growing in Iran by GC-MS, Middle-East J. Sci. Res., 2012, 11, 2, 221-224. [all data]