E-13-Octadecen-1-ol acetate

Normal alkane RI, polar column, temperature ramp

Data compiled by: NIST Mass Spectrometry Data Center, William E. Wallace, director

Column type Capillary
Active phase AT-Wax
Column length (m) 30.
Carrier gas He
Substrate
Column diameter (mm) 0.25
Phase thickness (μm) 0.25
Tstart (C) 100.
Tend (C) 250.
Heat rate (K/min) 10.
Initial hold (min) 1.
Final hold (min)
I 2045.
ReferenceReboucas, Sant-Ana, et al., 2007
Comment MSDC-RI

References

Reboucas, Sant-Ana, et al., 2007
Reboucas, L.M.; Sant-Ana, A.E.G.; Griepink, F.C., Kovats retention indexes of mono- and di-unsaturated C18 alcohols, acetates and aldehydes found in Lepidopteran pheromone blends in XVI International Plant Protection Congress. Congress Proceedings. Vol.2, Scottish Exhibition and Conference Centre, Glagow, Scotland, UK, 15-18 October, 2007, 2007, 590-591. [all data]