1,5-Anhydro-l-rhamnitol triacetate

Van Den Dool and Kratz RI, non-polar column, temperature ramp

Data compiled by: NIST Mass Spectrometry Data Center, William E. Wallace, director

Column type Capillary
Active phase DB-5
Column length (m) 30.
Carrier gas He
Substrate
Column diameter (mm) 0.25
Phase thickness (μm) 0.25
Tstart (C) 80.
Tend (C) 250.
Heat rate (K/min) 2.
Initial hold (min)
Final hold (min)
I 1567.79
ReferenceElvebak, Wittmeyer, et al., 1997
Comment MSDC-RI

References

Elvebak, Wittmeyer, et al., 1997
Elvebak, L.E., II; Wittmeyer, P.; Gray, G.R., Authentic standards for the reductive-cleavage method. The positional isomers of partially methylated and acetylated or benzoylated 1,5-anhydro-L-rhamnitol, Carbohyd. Res., 1997, 299, 3, 151-158, https://doi.org/10.1016/S0008-6215(97)00008-6 . [all data]