Menthol, O-isobutenyryl-

Normal alkane RI, non-polar column, custom temperature program

View large format table.

Column type Active phase I Reference Comment
PackedApieson L1174.Mamedov E.G., 2001Program: not specified

References

Mamedov E.G., 2001
Mamedov E.G., Asymmetrical [4+2]-cycloaddition of (-)-menthyl acrylate and (-)-menthyl methacrylate to cyclopentadiene in the presence of PBr3, Rus. J. Org. Chem., 2001, 37, 2, 217-222, https://doi.org/10.1023/A:1012374828303 . [all data]