Amphetamine TFA

Kovats' RI, non-polar column, isothermal

Data compiled by: NIST Mass Spectrometry Data Center, William E. Wallace, director

Column type Packed
Active phase OV-101
Column length (m) 1.5
Carrier gas He
Substrate Chromosorb W AW DMCS
Column diameter (mm)
Phase thickness (μm)
Temperature (C) 270.
I 1293.
ReferenceDonike, 1975
Comment MSDC-RI

References

Donike, 1975
Donike, M., N-trifluoracetyl-o-trimethylsilyl-phenolalkylamine. Darstellung und massenspezifischer gaschromatographischer nachweis, J. Chromatogr., 1975, 103, 1, 91-112, https://doi.org/10.1016/S0021-9673(00)83805-4 . [all data]