N-(2-Methylbutyl)-(2E,6Z,8E)-decatrienamide

Normal alkane RI, non-polar column, temperature ramp

Data compiled by: NIST Mass Spectrometry Data Center, William E. Wallace, director

Column type Capillary
Active phase DB-1
Column length (m) 60.
Carrier gas He
Substrate
Column diameter (mm) 0.25
Phase thickness (μm) 0.25
Tstart (C) 50.
Tend (C) 250.
Heat rate (K/min) 2.5
Initial hold (min) 5.
Final hold (min)
I 1946.
ReferenceStashenko, Puertas, et al., 1996
Comment MSDC-RI

Normal alkane RI, polar column, temperature ramp

Data compiled by: NIST Mass Spectrometry Data Center, William E. Wallace, director

Column type Capillary
Active phase DB-Wax
Column length (m) 60.
Carrier gas He
Substrate
Column diameter (mm) 0.25
Phase thickness (μm) 0.25
Tstart (C) 50.
Tend (C) 180.
Heat rate (K/min) 2.5
Initial hold (min) 5.
Final hold (min)
I 2546.
ReferenceStashenko, Puertas, et al., 1996
Comment MSDC-RI

References

Stashenko, Puertas, et al., 1996
Stashenko, E.E.; Puertas, M.A.; Combariza, M.Y., Volatile secondary metabolites from Spilanthes americana obtained by simultaneous steam distillation--solvent extraction and supercritical fluid extraction, J. Chromatogr. A, 1996, 752, 1-2, 223-232, https://doi.org/10.1016/S0021-9673(96)00480-3 . [all data]