5A-Androstan-3A,16B,17B-triol, tris-TMS

Van Den Dool and Kratz RI, non-polar column, temperature ramp

View large format table.

Column type Active phase I Reference Comment
PackedSE-302807.Grote and Spiteller, 1977Chromosorb W AW DMCS, 1. K/min; Column length: 1.5 m; Tstart: 200. C

References

Grote and Spiteller, 1977
Grote, H.; Spiteller, G., Location of Functional Groups with the Aid of Mass Spectrometry. XVI-Mass Spectra of Trimethylsilylated Androstan-3,16,17β-triols, Biomed. Mass Spectrom., 1977, 4, 4, 216-219, https://doi.org/10.1002/bms.1200040405 . [all data]