(1R2S)-Norephedrine, N-(2-phenylbutanoyl)-O-TMS

Kovats' RI, non-polar column, isothermal

View large format table.

Column type Active phase Temperature (C) I Reference Comment
PackedOV-1190.2280.Gilbert and Brooks, 1977N2, Gas Chrom Q; Column length: 3. m

References

Gilbert and Brooks, 1977
Gilbert, M.T.; Brooks, C.J.W., Characterization of Diastereomeric and Enantiomeric Ephedrines by Gas Chromatography Combined with Electron Impact Mass Spectrometry and Isobutane Chemical Ionization Mass Spectrometry, Biomed. Mass Spectrom., 1977, 4, 4, 226-231, https://doi.org/10.1002/bms.1200040407 . [all data]