(Z)-9-Docosenoic acid, methyl ester

Kovats' RI, non-polar column, isothermal

Data compiled by: NIST Mass Spectrometry Data Center, William E. Wallace, director

Column type Packed
Active phase SE-30
Column length (m) 1.5
Carrier gas
Substrate Gas Chrom Q (80-100 mesh)
Column diameter (mm)
Phase thickness (μm)
Temperature (C) 200.
I 2479.
ReferenceGolovnya, Uralets, et al., 1976
Comment MSDC-RI

References

Golovnya, Uralets, et al., 1976
Golovnya, R.V.; Uralets, V.P.; Kuzmenko, T.E., Characterization of fatty acid methyl esters by gas chromatography on siloxane liquid phases, J. Chromatogr., 1976, 121, 1, 118-121, https://doi.org/10.1016/S0021-9673(00)82312-2 . [all data]