(Z)-3-Pentadecene

Kovats' RI, polar column, temperature ramp

Data compiled by: NIST Mass Spectrometry Data Center, William E. Wallace, director

Column type Capillary
Active phase Carbowax 20M
Column length (m) 50.
Carrier gas
Substrate
Column diameter (mm) 0.25
Phase thickness (μm)
Tstart (C) 80.
Tend (C) 180.
Heat rate (K/min) 2.
Initial hold (min)
Final hold (min)
I 1548.
ReferenceTamura, Kihara, et al., 1991
Comment MSDC-RI

References

Tamura, Kihara, et al., 1991
Tamura, H.; Kihara, S.; Nakahara, K.; Sugisawa, H., A program for predicting aliphatic compounds using linear equations of GC retention index value, Nippon Shokuhin Kogyo Gakkaishi, 1991, 38, 10, 934-939, https://doi.org/10.3136/nskkk1962.38.934 . [all data]