Androstenetriol MO TMS

Van Den Dool and Kratz RI, non-polar column, temperature ramp

View large format table.

Column type Active phase I Reference Comment
CapillaryOV-12865.Luyten and Rutten, 1974He, 1. K/min; Column length: 20. m; Column diameter: 0.25 mm; Tstart: 220. C
CapillarySE-302859.Luyten and Rutten, 1974He, 1. K/min; Column length: 20. m; Column diameter: 0.25 mm; Tstart: 200. C
PackedSE-302840.Luyten and Rutten, 1974He, 1. K/min; Column length: 20. m; Column diameter: 0.25 mm; Tstart: 180. C

Van Den Dool and Kratz RI, non-polar column, custom temperature program

View large format table.

Column type Active phase I Reference Comment
CapillaryBP-12868.Hähnel, Wilkinson, et al., 1985He; Column length: 25. m; Column diameter: 0.3 mm; Program: 40C (1min) => 20C/min => 200C => 2C/min => 300C (11min)

Normal alkane RI, non-polar column, temperature ramp

View large format table.

Column type Active phase I Reference Comment
CapillaryBP-12890.Yong, Pitt, et al., 1988Helium, 3. K/min; Column length: 25. m; Column diameter: 0.22 mm; Tstart: 180. C; Tend: 300. C

References

Luyten and Rutten, 1974
Luyten, J.A.; Rutten, G.A.F.M., Analysis of Steroids by High-Resolution Gas-Liquid Chromatography. II. Application to Urinary Samples, J. Chromatogr., 1974, 91, 393-406, https://doi.org/10.1016/S0021-9673(01)97918-X . [all data]

Hähnel, Wilkinson, et al., 1985
Hähnel, E.; Wilkinson, S.P.; Hähnel, R., Urinary steroid profiles in pregnancy by capillary column gas chromatography, Clin. Chim. Acta, 1985, 151, 3, 259-271, https://doi.org/10.1016/0009-8981(85)90089-0 . [all data]

Yong, Pitt, et al., 1988
Yong, A.B.W.; Pitt, J.J.; Montalto, J.; Davies, H.E.; Warne, G.L.; Connelly, J.F., Diagnosis of 21-hydroxylase deficiency in newborn infants by GC-MS of urinary steroids, Aust. Paediatr., 1988, 24, 280-285. [all data]