Pentanoic acid, 4-methyl, 3-methylbutyl ester

Kovats' RI, non-polar column, isothermal

View large format table.

Column type Active phase Temperature (C) I Reference Comment
PackedSE-30150.1181.Ashes and Haken, 1974Celaton (62-72 mesh); Column length: 3.7 m
PackedSE-30150.1198.Germaine and Haken, 1969Celite 560; Column length: 3.7 m

Kovats' RI, non-polar column, custom temperature program

View large format table.

Column type Active phase I Reference Comment
CapillarySE-301181.Chretien and Dubois, 1978Program: not specified

Normal alkane RI, non-polar column, custom temperature program

View large format table.

Column type Active phase I Reference Comment
CapillarySE-301181.Liu, Liang, et al., 2007Program: not specified

References

Ashes and Haken, 1974
Ashes, J.R.; Haken, J.K., Gas chromatography of homologous esters. VI. Structure-retention increments of aliphatic esters, J. Chromatogr., 1974, 101, 1, 103-123, https://doi.org/10.1016/S0021-9673(01)94737-5 . [all data]

Germaine and Haken, 1969
Germaine, R.W.; Haken, J.K., Gas chromatography of homologous esters. Part 1. Simple aliphatic esters, J. Chromatogr., 1969, 43, 33-42, https://doi.org/10.1016/S0021-9673(00)99162-3 . [all data]

Chretien and Dubois, 1978
Chretien, J.R.; Dubois, J-E., Topological Analysis: A Technique for the Physico-Chemical Exploitation of Retention Data in Gas-Liquid Chromatography, J. Chromatogr., 1978, 158, 43-56, https://doi.org/10.1016/S0021-9673(00)89954-9 . [all data]

Liu, Liang, et al., 2007
Liu, F.; Liang, Y.; Cao, C.; Zhou, N., QSPR study of GC retention indices for saturated esters on seven stationary phases based on novel topological indices, Talanta, 2007, 72, 4, 1307-1315, https://doi.org/10.1016/j.talanta.2007.01.038 . [all data]