Pentanoic acid, 2-methyl, hexyl ester

Kovats' RI, non-polar column, custom temperature program

Data compiled by: NIST Mass Spectrometry Data Center, William E. Wallace, director

Column type Capillary
Active phase SE-30
Column length (m)
Carrier gas
Substrate
Column diameter (mm)
Phase thickness (μm)
Program not specified
I 1277.
ReferenceChretien and Dubois, 1978
Comment MSDC-RI

Kovats' RI, non-polar column, isothermal

View large format table.

Column type Active phase Temperature (C) I Reference Comment
PackedSE-30150.1277.Ashes and Haken, 1974Celaton (62-72 mesh); Column length: 3.7 m

Normal alkane RI, non-polar column, custom temperature program

View large format table.

Column type Active phase I Reference Comment
CapillarySE-301277.Liu, Liang, et al., 2007Program: not specified

References

Chretien and Dubois, 1978
Chretien, J.R.; Dubois, J-E., Topological Analysis: A Technique for the Physico-Chemical Exploitation of Retention Data in Gas-Liquid Chromatography, J. Chromatogr., 1978, 158, 43-56, https://doi.org/10.1016/S0021-9673(00)89954-9 . [all data]