Desoxyhumulone, TMS

Normal alkane RI, non-polar column, temperature ramp

Data compiled by: NIST Mass Spectrometry Data Center, William E. Wallace, director

Column type Capillary
Active phase OV-1
Column length (m) 80.
Carrier gas N2
Substrate
Column diameter (mm) 0.8
Phase thickness (μm)
Tstart (C) 190.
Tend (C)
Heat rate (K/min) 1.
Initial hold (min)
Final hold (min)
I 2348.
ReferenceVanluchene and Verzele, 1973
Comment MSDC-RI

References

Vanluchene and Verzele, 1973
Vanluchene, E.; Verzele, M., Glass Capillary Gas Chromatography of Hop Bitter Acids. II. Desoxy-α-Acids in Hop Extracts, Chromatographia, 1973, 6, 12, 519-521, https://doi.org/10.1007/BF02269134 . [all data]