trans-Cohumulinic acid, TMS

Kovats' RI, non-polar column, isothermal

View large format table.

Column type Active phase Temperature (C) I Reference Comment
CapillaryOV-1200.2142.Verzele, Vanluchene, et al., 1973Column length: 73. m; Column diameter: 0.9 mm
CapillaryOV-1230.2183.Verzele, Vanluchene, et al., 1973Column length: 73. m; Column diameter: 0.9 mm
CapillaryOV-1200.2152.Verzele, Vanluchene, et al., 1973Column length: 73. m; Column diameter: 0.9 mm
CapillaryOV-1230.2184.Verzele, Vanluchene, et al., 1973Column length: 73. m; Column diameter: 0.9 mm

Normal alkane RI, non-polar column, temperature ramp

View large format table.

Column type Active phase I Reference Comment
CapillaryOV-12118.Vanluchene and Verzele, 1973N2, 1. K/min; Column length: 80. m; Column diameter: 0.8 mm; Tstart: 190. C
CapillaryOV-12125.Vanluchene and Verzele, 1973N2, 1. K/min; Column length: 80. m; Column diameter: 0.8 mm; Tstart: 190. C

References

Verzele, Vanluchene, et al., 1973
Verzele, M.; Vanluchene, E.; Van Dyck, J., Gas chromatography of beer bitter acids, Anal. Chem., 1973, 45, 8, 1549-1552, https://doi.org/10.1021/ac60330a059 . [all data]

Vanluchene and Verzele, 1973
Vanluchene, E.; Verzele, M., Glass Capillary Gas Chromatography of Hop Bitter Acids. II. Desoxy-α-Acids in Hop Extracts, Chromatographia, 1973, 6, 12, 519-521, https://doi.org/10.1007/BF02269134 . [all data]