cis-1,3,5-Cyclohexanetricarboxylic acid, trimethyl ester

Kovats' RI, non-polar column, isothermal

View large format table.

Column type Active phase Temperature (C) I Reference Comment
PackedSE-30200.1791.Safar, Kafka, et al., 1972N2, Chromosorb G (60-80 mesh); Column length: 3.6 m

References

Safar, Kafka, et al., 1972
Safar, M.; Kafka, Z.; Galik, V.; Landa, S., Gas Chromatographic Analysis of 1,3,5-Benzenetricarboxylic and 1,3,5-Cyclohexanetricarboxylic Acid and Their Derivatives, Collect. Czech. Chem. Commun., 1972, 39, 11, 3390-3393, https://doi.org/10.1135/cccc19743390 . [all data]