Hypoxanthine riboside, TMS

Van Den Dool and Kratz RI, non-polar column, temperature ramp

Data compiled by: NIST Mass Spectrometry Data Center, William E. Wallace, director

Column type Packed
Active phase OV-1
Column length (m) 2.
Carrier gas He
Substrate Chromosorb W HP (80-100 mesh)
Column diameter (mm)
Phase thickness (μm)
Tstart (C) 100.
Tend (C) 325.
Heat rate (K/min) 10.
Initial hold (min)
Final hold (min)
I 2591.
ReferenceButts, 1972
Comment MSDC-RI

References

Butts, 1972
Butts, W.C., Two-Column Gas Chromatography of Trimethylsilyl Derivatives of Biochemically Significant Compounds, Anal. Biochemistry, 1972, 46, 1, 187-199, https://doi.org/10.1016/0003-2697(72)90411-3 . [all data]