Nicotinuric acid, TMS

Van Den Dool and Kratz RI, non-polar column, temperature ramp

Data compiled by: NIST Mass Spectrometry Data Center, William E. Wallace, director

Column type PackedPacked
Active phase OV-1OV-1
Column length (m) 2.2.
Carrier gas HeHe
Substrate Chromosorb W HP (80-100 mesh)Chromosorb W HP (80-100 mesh)
Column diameter (mm)
Phase thickness (μm)
Tstart (C) 100.100.
Tend (C) 325.325.
Heat rate (K/min) 10.10.
Initial hold (min)
Final hold (min)
I 1848.1848.
ReferenceButts, 1972Butts, 1972
Comment MSDC-RI MSDC-RI

References

Butts, 1972
Butts, W.C., Two-Column Gas Chromatography of Trimethylsilyl Derivatives of Biochemically Significant Compounds, Anal. Biochemistry, 1972, 46, 1, 187-199, https://doi.org/10.1016/0003-2697(72)90411-3 . [all data]