11-Hydroxyetiocholanolone MO TMS

Kovats' RI, non-polar column, isothermal

Data compiled by: NIST Mass Spectrometry Data Center, William E. Wallace, director

Column type CapillaryCapillaryCapillaryCapillary
Active phase SE-30SE-30SE-30OV-1
Column length (m) 30.30.30.20.
Carrier gas N2N2N2He
Substrate
Column diameter (mm) 0.250.250.250.25
Phase thickness (μm)
Temperature (C) 221.231.241.255.
I 2700.2709.2721.2744.
ReferenceMitra, 1982Mitra, 1982Mitra, 1982Luyten and Rutten, 1974
Comment MSDC-RI MSDC-RI MSDC-RI MSDC-RI

References

Mitra, 1982
Mitra, G.D., Determination of precise retention indices of steroids using an all-glass solid injection system, J. Chromatogr., 1982, 234, 1, 214-217, https://doi.org/10.1016/S0021-9673(00)81795-1 . [all data]

Luyten and Rutten, 1974
Luyten, J.A.; Rutten, G.A.F.M., Analysis of Steroids by High-Resolution Gas-Liquid Chromatography. II. Application to Urinary Samples, J. Chromatogr., 1974, 91, 393-406, https://doi.org/10.1016/S0021-9673(01)97918-X . [all data]