Dehydroepiandrosterone MO TMS

Kovats' RI, non-polar column, isothermal

Data compiled by: NIST Mass Spectrometry Data Center, William E. Wallace, director

Column type CapillaryCapillaryCapillaryCapillary
Active phase SE-30SE-30SE-30OV-1
Column length (m) 30.30.30.20.
Carrier gas N2N2N2He
Substrate
Column diameter (mm) 0.250.250.250.25
Phase thickness (μm)
Temperature (C) 221.231.241.255.
I 2542.2557.2579.2625.
ReferenceMitra, 1982Mitra, 1982Mitra, 1982Luyten and Rutten, 1974
Comment MSDC-RI MSDC-RI MSDC-RI MSDC-RI

Van Den Dool and Kratz RI, non-polar column, temperature ramp

View large format table.

Column type Active phase I Reference Comment
PackedOV-1012590.Hurter and van Ree, 1979Gas-Chrom P (80-100 mesh), 1. K/min; Column length: 3.6 m; Tstart: 180. C
PackedSE-302582.Hurter and van Ree, 1979Gas-Chrom P (80-100 mesh), 1. K/min; Column length: 3.6 m; Tstart: 180. C
PackedOV-12563.Luyten and Rutten, 1974He, 1. K/min; Column length: 20. m; Column diameter: 0.25 mm; Tstart: 180. C
CapillaryOV-12596.Luyten and Rutten, 1974He, 1. K/min; Column length: 20. m; Column diameter: 0.25 mm; Tstart: 220. C
CapillarySE-302599.Luyten and Rutten, 1974He, 1. K/min; Column length: 20. m; Column diameter: 0.25 mm; Tstart: 200. C
PackedSE-302563.Luyten and Rutten, 1974He, 1. K/min; Column length: 20. m; Column diameter: 0.25 mm; Tstart: 180. C

Normal alkane RI, non-polar column, isothermal

View large format table.

Column type Active phase Temperature (C) I Reference Comment
CapillaryOV-101240.2622.Krupcik, Rutten, et al., 1976Column length: 30. m; Column diameter: 0.25 mm
PackedOV-1180. - 200.2563.Horning, Moss, et al., 1968N2, Gas Chrom P; Column length: 3.7 m

References

Mitra, 1982
Mitra, G.D., Determination of precise retention indices of steroids using an all-glass solid injection system, J. Chromatogr., 1982, 234, 1, 214-217, https://doi.org/10.1016/S0021-9673(00)81795-1 . [all data]

Luyten and Rutten, 1974
Luyten, J.A.; Rutten, G.A.F.M., Analysis of Steroids by High-Resolution Gas-Liquid Chromatography. II. Application to Urinary Samples, J. Chromatogr., 1974, 91, 393-406, https://doi.org/10.1016/S0021-9673(01)97918-X . [all data]